{"text_format":"1","workbook":"xlsx","n_sheets":9,"sheets":["Titelblatt","Blatt 0 Verodnungen","Anleitung","Scheine","Stammdaten","Blatt 1 Maßnahme und Erfassung","Blatt 2 Gemische und Erfassung","Abfall","Table 0"],"not_rendered":{"charts":0,"images":9,"macros":1,"external_links":0,"defined_names":7,"comments":2,"pivot_tables":0},"unopened":[],"bounds":{"document_bytes":16777216,"sheet_cells":100000,"rows_first":2000,"rows_last":500,"rows_between":2000,"halvings":0,"cell_chars":16384,"cell_head_chars":4096},"cells_cut":0,"cells_raw":0,"read":"whole","date_system":"1900"}

{"sheet":"Titelblatt","index":0,"n_rows":55,"n_cols":2,"rows_kept":55,"cut":false,"hidden":false,"merged":[[29,1,42,8]]}
[]
[]
[]
[]
[]
[]
[]
[]
[]
[]
[]
[]
[]
[]
[]
[]
[]
[]
[]
[null,"Dokumentation "]
{"$rows_left_out":36}
{"sheet":"Blatt 0 Verodnungen","index":1,"n_rows":39,"n_cols":2,"rows_kept":39,"cut":false,"hidden":false,"merged":[]}
[null,"Hinweise zur Dokumentation der Entsorgung von Bauabfällen nach Gewerbeabfallverordnung "]
[]
["1.","Allgemeine Hinweise zur Dokumentation"]
[null,"Es wird empfohlen, die Dokumentation elektronisch auszufüllen. Diese Datei enthält automatische Berechnungen und Verknüpfungen, um Ihnen das Ausfüllen zu erleichtern. Ausführliche Informationen zu den sich aus der "]
[null,"GewAbfV ergebenen Pflichten erhalten Sie in der  LAGA Mitteilung 34."]
[null,"Für jede Bau- und Abbruchmaßnahme bzw. jede Baustelle ist eine Dokumentation zu erstellen und auf Verlangen der zuständigen Behörde vorzulegen."]
[null," Dies kann elektronisch oder in Papierform erfolgen."]
[null,"Der Verbleib ALLER getrennt erfassten Fraktionen und Gemische muss nachgewiesen werden. Die Belege müssen den Namen und die Anschrift desjenigen enthalten, der die Abfälle übernimmt, sowie die Masse und den beabsichtigten Verbleib des Abfalls (z.B. Recycling). "]
[null,"Die Dokumentationspflichten richten sich gleichermaßen an Abfallerzeuger und -besitzer. Vorrangig sind sie durch den frühesten Verursacher der Abfallentstehung zu erfüllen. Dies ist in der Regel der Bauherr. Dieser kann das bauausführende Unternehmen damit beauftragen. Die vollständige Dokumentation sollte dem Bauherren mit Stellung der Abschlussrechnung des Bauvorhabens vorliegen."]
[null,"Die Unterlagen sind 3 Jahre nach Bauabschluss für eine etwaige Prüfung aufzubewahren. "]
[null,"Geringe Mengen nichtmineralische Restabfälle, die nicht unmittelbar durch die Bautätigkeit auf der Baustelle entstehen, wie z.B. Butterbrotpapier, Getränkeflaschen, Lebensmittelreste, müssen nicht getrennt erfasst und dokumentiert werden. "]
[]
["2.","Ausnahmenregelung für Baustellen mit weniger als 10 m³ Abfallanfall"]
[null,"Wenn das Volumen der insgesamt anfallenden Abfälle je Bau- oder Abbruchmaßnahme 10 m³ nicht überschreitet, entfällt die Pflicht zur Dokumentation. Die Pflichten zur getrennten Sammlung und Zuführung zur Vorbereitung zur Wiederverwendung und zum Recycling bleiben aber bestehen. "]
[null,"Bei einer Baumaßnahme ist jedes Gewerk als Einzelmaßnahme zu bezeichnen, es sei denn, ein Unternehmen erbringt und koordiniert federführend mehrere Gewerke. Wenn das Volumen der bei allen Gewerken anfallenden Abfälle 10 m³ überschreitet, muss dokumentiert werden. Gleiches gilt für den Fall, dass ein Generalunternehmer die Entsorgung für seine Subunternehmer durchführt oder im Falle der Entsorgung durch den Bauherren selbst. "]
["3.","Getrenntsammlung und Recycling bzw. Vorbereitung zur Wiederverwendung sowie \nAusnahmen von der Getrenntsammlung"]
[null,"Die in Blatt 2 gelisteten Abfallfraktionen sind getrennt zu erfassen und vorrangig der Vorbereitung zur Wiederverwendung oder dem Recycling zuzuführen. Die Liste ist abschließend. Weitere Fraktionen sind nicht zu dokumentieren."]
[null,"Nur falls in seltenen Fällen, z.B. aufgrund einer Schadstoffbelastung, keine Wiederverwendung und kein Recycling  einer getrennt gesammelten Fraktion möglich ist, ist diese Fraktionen der sonstigen (energetischen) Verwertung oder der Beseitigung zuzuführen. Der Verbleib aller getrennt erfassten Fraktionen ist zu dokumentieren und über Praxisbelege nachzuweisen. "]
[null,"Innerhalb der getrennt erfassten Abfallfraktionen kann eine weitergehende getrennte Sammlung vorgenommen werden."]
[null,"Von der Grundpflicht zur getrennten Erfassung darf nur in begründeten Einzelfällen abgewichen werden. Für jede Abfallfraktion ist einzeln nachvollziehbar darzulegen, aus welchem Grund die getrennte Sammlung nicht durchführbar ist (Blatt 3 \"Ausnahme Getrennthaltung\")."]
{"$rows_left_out":20}
{"sheet":"Anleitung","index":2,"n_rows":31,"n_cols":1,"rows_kept":31,"cut":false,"hidden":false,"merged":[]}
[]
["Tragen Sie alle Container etc. in das Register \"Scheine\" ein."]
["Bodenaushub, Sand & Steine werden nicht erfasst! Sie fallen nicht unter die GewAbfV."]
["Gefährliche Abfälle werden über ZEDAL erfasst und ebenfalls nicht hier."]
["Die farbigen Zellen sind für Ihre Eingaben gedacht."]
["Weist der Schein nur eine Volumenangabe auf, so werden die Kubikmeter in Tonnen umgerechnet."]
["Stehen auf dem Schein Angaben zum Recycling, Wiederverwendung oder sonstiger Verwertung so vermerken Sie das Bitte hinten im \"blauen\" Bereich."]
[]
["Was bedeutet \"gestempelt\"."]
["Werden die Scheine über Formulare abgerechnet, und die Firma unterschreibt die Formulare so können Sie bei \"gestempelt\" ein \"ja\" eintragen."]
["Sie können das \"ja\" auch ruhig dem Programm überlassen. Füllen sie die Scheine automatisiert aus, erledigt das das Programm für Sie."]
[]
["Brauche ich einen Taschenrecher?"]
["Definitiv: Nein."]
[]
["Ich möchte die Formulare für die Firma erzeugen."]
["Wählen Sie \"Blatt 1 Maßnahme und Erfassung\" aus und anschließend wählen sie rechts neben dem Formular in den zwei blauen Feldern zunächst die Firma aus."]
["Jetzt werden die Entsorger der Firma zusammengestellt."]
["Wählen Sie jetzt einen Entsorger aus."]
["Fertig, alle Scheine der Firma und des Entsorgers werden in die beiden Blätter eingetragen."]
{"$rows_left_out":12}
{"sheet":"Scheine","index":3,"n_rows":800,"n_cols":15,"rows_kept":800,"cut":false,"hidden":false,"merged":[]}
["*Mindestangaben",null,null,null,null,null,null,null,null,null,null,"davon"]
["Abfall-schlüssel-nummer","Abfallart*","Erzeuger (Firma)*","Beförderer*","Belegnummer","Beförderungs-datum","Entsorger*","Menge*","Einheit*","gestempelt","Gewicht [t]","Wiederver-wendung\n[t]","Recycling\n[t]","Verwertung\n[t]","Fehlerhinweis"]
[{"$f":"_xlfn.XLOOKUP(B3,Stammdaten!$C$3:$C$14,Stammdaten!$A$3:$A$14,\"\",0,1)","v":""},null,null,null,null,null,null,null,null,"nein",{"$f":"IFERROR(IF(I3=\"t\",H3,H3*VLOOKUP(A3,Stammdaten!$A$3:$C$14,2,FALSE)),\"\")","v":""},null,null,null,{"$f":"IF(SUM(L3:N3)>K3,\"'davon' ist größer als Gesamtgewicht.\",\"\")","v":""}]
[{"$f":"_xlfn.XLOOKUP(B4,Stammdaten!$C$3:$C$14,Stammdaten!$A$3:$A$14,\"\",0,1)","v":""},null,null,null,null,null,null,null,null,"nein",{"$f":"IFERROR(IF(I4=\"t\",H4,H4*VLOOKUP(A4,Stammdaten!$A$3:$C$14,2,FALSE)),\"\")","v":""},null,null,null,{"$f":"IF(SUM(L4:N4)>K4,\"'davon' ist größer als Gesamtgewicht.\",\"\")","v":""}]
[{"$f":"_xlfn.XLOOKUP(B5,Stammdaten!$C$3:$C$14,Stammdaten!$A$3:$A$14,\"\",0,1)","v":""},null,null,null,null,null,null,null,null,"nein",{"$f":"IFERROR(IF(I5=\"t\",H5,H5*VLOOKUP(A5,Stammdaten!$A$3:$C$14,2,FALSE)),\"\")","v":""},null,null,null,""]
[{"$f":"_xlfn.XLOOKUP(B6,Stammdaten!$C$3:$C$14,Stammdaten!$A$3:$A$14,\"\",0,1)","v":""},null,null,null,null,null,null,null,null,"nein",{"$f":"IFERROR(IF(I6=\"t\",H6,H6*VLOOKUP(A6,Stammdaten!$A$3:$C$14,2,FALSE)),\"\")","v":""},null,null,null,""]
[{"$f":"_xlfn.XLOOKUP(B7,Stammdaten!$C$3:$C$14,Stammdaten!$A$3:$A$14,\"\",0,1)","v":""},null,null,null,null,null,null,null,null,"nein",{"$f":"IFERROR(IF(I7=\"t\",H7,H7*VLOOKUP(A7,Stammdaten!$A$3:$C$14,2,FALSE)),\"\")","v":""},null,null,null,""]
[null,null,null,null,null,null,null,null,null,"nein"]
[null,null,null,null,null,null,null,null,null,"nein"]
[null,null,null,null,null,null,null,null,null,"nein"]
[null,null,null,null,null,null,null,null,null,"nein"]
[null,null,null,null,null,null,null,null,null,"nein"]
[null,null,null,null,null,null,null,null,null,"nein"]
[null,null,null,null,null,null,null,null,null,"nein"]
[null,null,null,null,null,null,null,null,null,"nein"]
[null,null,null,null,null,null,null,null,null,"nein"]
[null,null,null,null,null,null,null,null,null,"nein"]
[null,null,null,null,null,null,null,null,null,"nein"]
[null,null,null,null,null,null,null,null,null,"nein"]
[null,null,null,null,null,null,null,null,null,"nein"]
{"$rows_left_out":781}
{"sheet":"Stammdaten","index":4,"n_rows":14,"n_cols":15,"rows_kept":14,"cut":false,"hidden":true,"merged":[]}
["Quelle: https://statistik.bayern.de/service/erhebungen/bauen_wohnen/abfall/abfallarten/index.php",null,null,null,null,null,null,null,null,null,null,null,"Firmenliste","Entsorgerliste","Verwerter"]
["Abfallschlüssel","m³ in t","Abfallart","Siehe ausgeblendete Table 0"]
[170101,1.3,"Beton"]
[170102,1.3,"Ziegel"]
[170103,1.3,"Fliesen, Ziegel und Keramik"]
[170201,0.5,"Holz"]
[170202,1.2,"Glas"]
[170203,0.6,"Kunststoff"]
[170302,1.8,"Bitumengemische"]
[170401,2.1,"Metalle, einschließl. Legierung"]
[170604,0.3,"Dämmmaterial"]
[170802,0.34,"Baustoffe auf Gipsbasis"]
[170107,1.3,"Gemische aus Beton, Ziegeln, Fliesen und Keramik (Gemisch nach § 9 (1) Nr. 2)"]
[170904,0.6,"gemischte Bau- und Abbruchabfälle (Gemisch nach § 9 (1) Nr. 1)"]

{"sheet":"Blatt 1 Maßnahme und Erfassung","index":5,"n_rows":33,"n_cols":12,"rows_kept":33,"cut":false,"hidden":false,"merged":[[29,0,29,1],[29,2,29,3],[29,4,29,5],[32,0,32,8],[27,0,27,1],[27,2,27,3],[27,4,27,5],[28,0,28,1],[28,2,28,3],[28,4,28,5],[25,0,25,1],[25,2,25,3],[25,4,25,5],[26,0,26,1],[26,2,26,3],[26,4,26,5],[23,0,23,1],[23,2,23,3],[23,4,23,5],[24,0,24,1],[24,2,24,3],[24,4,24,5],[21,0,21,1],[21,2,21,3],[21,4,21,5],[22,0,22,1],[22,2,22,3],[22,4,22,5],[19,0,19,1],[19,2,19,3],[19,4,19,5],[20,0,20,1],[20,2,20,3],[20,4,20,5],[1,0,1,8],[3,0,4,0],[3,1,4,8],[5,0,6,0],[7,0,8,0],[7,1,7,5],[7,6,7,8],[8,1,8,8],[5,4,5,8],[6,1,6,8],[18,0,18,1],[18,2,18,3],[18,4,18,5],[12,0,12,3],[13,0,13,3],[15,2,15,9],[17,0,17,1],[17,2,17,9]]}
[]
["1. Angaben zur Baumaßnahme ___________________________________________________ vom ________________ bis ________________"]
[]
["Grundstück/Adresse:",null,null,null,null,null,null,null,null,null,null,"Auswahl zur automatischen Übernahme aus der Liste \"Scheine\"."]
[null,null,null,null,null,null,null,null,null,null,null,"Wählen Sie eine \"Firma\" aus."]
["Bauherr \n(und verantwortlicher Ansprechpartner)","GESOBAU AG, Stiftsweg 1, 13187 Berlin",null,null,null,null,null,null,null,null,null,"Falls Mischabfälle vorhanden sind, wählen Sie auch einen \"Entsorger\" aus."]
[null,null,null,null,null,null,null,null,null,null,null,"Drucken Sie die Liste."]
["Bauausführendes Unternehmen \n(und verantwortlicher Ansprechpartner)",{"$f":"IF(M11=\"\",\"\",M11)","v":""},null,null,null,null,null,null,null,null,null,"Stellen Sie im Register \"Scheine\" die eben in dieses Formular übernommenen Scheine bei \"gestempelt\" von \"nein\" auf \"ja\"."]
[null,null,null,null,null,null,null,null,null,null,null,"Beim nächsten Drucken werden die auf \"ja\" eingestellten Scheine nicht mehr summiert."]
[null,null,null,null,null,null,null,null,null,null,null,"Auswahl:"]
["2. Feststellung der Dokumentationspflicht durch den AN* ",null,null,null,null,null,null,null,null,null,null,"Firma"]
[null,null,null,null,"zutreffendes bitte ankreuzen",null,null,null,null,null,null,"Entsorger"]
["(1.) Bei der Baumaßnahme fallen 10m³ Bauabfall gemäß GewAbfV oder mehr an "]
["(2.)  Bei der Baumaßnahme fallen weniger als 10m³ Bauabfall gemäß GewAbfV an\n        (Falls 2. (+), sind keine weiteren Angaben zu machen)"]
[]
["2.1 Getrennte Erfassung - Anfall und Entsorgung"]
[]
["Getrennt zu sammelnde Fraktionen nach § 8 GewAbfV\nListe ist abschließend! \nNachweise, gefährliche Abfälle sind hier nicht zu dokumentieren",null,"Entsorgung der getrennt erfassten Fraktionen mit dem Vorrang der Wiederverwednung oder dem Recycling \nNachweis des Verbleibs erforderlich!"]
[null,null,"Vorbereitung \nzur Wiederverwendung",null,"Recycling",null,"sonstige Verwertung\n(energetisch/Verfüllung","Beseitigung","Name und Anschrift \nEntsorgungsanlage","Annahmeerklärung/Wiegeschein etc. liegen vor"]
["Abfallschlüsselnummer nach AVV",null,"(t)",null,"(t)",null,"(t)","(t)"]
{"$rows_left_out":14}
{"sheet":"Blatt 2 Gemische und Erfassung","index":6,"n_rows":27,"n_cols":13,"rows_kept":27,"cut":false,"hidden":false,"merged":[[7,3,7,4],[8,3,8,4],[11,0,11,9],[13,0,13,2],[3,0,3,9],[4,7,4,9],[5,0,6,0],[5,1,6,1],[5,2,6,2],[5,3,6,4],[5,6,6,6]]}
[]
[null,null,null,null,null,null,null,null,null,null,null,null,{"$f":"\"Firma: \"&'Blatt 1 Maßnahme und Erfassung'!M11","v":"Firma: "}]
[null,null,null,null,null,null,null,null,null,null,null,null,{"$f":"\"Entsorger: \"&'Blatt 1 Maßnahme und Erfassung'!M12","v":"Entsorger: "}]
["2.2. Gemische Fraktionen, Anfall und Entsorgung nach § 9 GewAbfV"]
[null,null,null,null,null,null,null,"Wie wurde das Gemisch entsorgt\nNachweis des Verbleibs erforderlich!"]
["AVV-Nr.","Nachweis der\n Zusammensetzung","Begründung für Ausnahme\nnach § 8 Abs. 2 GewAbfV","Name und Adresse\nder Aufbereitungs- oder Vorbehandlungsanlage\n (inkl. Bestätigung\nnach § 9 Abs. 2 GewAbfV)",null,"Masse","Falls Ausnahmetatbestand nach § 9 Abs. 4 GewAbfV einschlägig ist \n","sonstige Verwertung\n(energ. oder Verfüllung) ","Beseitigung","Name und\n Adresse der Entsorgungsanlage"]
[null,null,null,null,null,"(t)",null,"(t)","(t)","Bitte angeben"]
["170107\nGemisch nach \n§ 9 (1) Nr. 2"," - Lichtbild -  oder Verweis auf Anlage","Begründung einfügen",{"$f":"IF(F8<>0,'Blatt 1 Maßnahme und Erfassung'!$M$12,\"\")","v":""},null,{"$f":"SUMIFS(Scheine!$K$3:$K$800,Scheine!$A$3:$A$800,LEFT($A8,6)*1,Scheine!$C$3:$C$800,'Blatt 1 Maßnahme und Erfassung'!$M$11,Scheine!$G$3:$G$800,'Blatt 1 Maßnahme und Erfassung'!$M$12,Scheine!$J$3:$J$800,\"<>ja\")","v":0},"Begründung einfügen",{"$f":"IF(F8<>0,SUMIFS(Scheine!$N$3:$N$800,Scheine!$A$3:$A$800,LEFT($A8,6)*1,Scheine!$C$3:$C$800,'Blatt 1 Maßnahme und Erfassung'!$M$11,Scheine!$G$3:$G$800,'Blatt 1 Maßnahme und Erfassung'!$M$12,Scheine!$J$3:$J$800,\"<>ja\"),\"\")","v":""},{"$f":"IF(F8<>0,F8-H8,\"\")","v":""},{"$f":"IF(F8<>0,'Blatt 1 Maßnahme und Erfassung'!$M$12,\"\")","v":""}]
["170904\nGemisch nach \n§ 9 (1) Nr. 1"," - Lichtbild -  oder Verweis auf Anlage","Begründung einfügen",{"$f":"IF(F9<>0,'Blatt 1 Maßnahme und Erfassung'!$M$12,\"\")","v":""},null,{"$f":"SUMIFS(Scheine!$K$3:$K$800,Scheine!$A$3:$A$800,LEFT($A9,6)*1,Scheine!$C$3:$C$800,'Blatt 1 Maßnahme und Erfassung'!$M$11,Scheine!$G$3:$G$800,'Blatt 1 Maßnahme und Erfassung'!$M$12,Scheine!$J$3:$J$800,\"<>ja\")","v":0},"Begründung einfügen",{"$f":"IF(F9<>0,SUMIFS(Scheine!$N$3:$N$800,Scheine!$A$3:$A$800,LEFT($A9,6)*1,Scheine!$C$3:$C$800,'Blatt 1 Maßnahme und Erfassung'!$M$11,Scheine!$G$3:$G$800,'Blatt 1 Maßnahme und Erfassung'!$M$12,Scheine!$J$3:$J$800,\"<>ja\"),\"\")","v":""},{"$f":"IF(F9<>0,F9-H9,\"\")","v":""},{"$f":"IF(F9<>0,'Blatt 1 Maßnahme und Erfassung'!$M$12,\"\")","v":""}]
[]
[]
[{"$f":"\"Hiermit bestätigt der AN \" &'Blatt 1 Maßnahme und Erfassung'!M11&\" dass die vorstehenden Angaben vollständig und korrekt sind sowie, dass alle unter die GewAbfV fallenden Abfallfraktionen und Abfälle ordnungsgemäß entsorgt worden sind.\"","v":"Hiermit bestätigt der AN  dass die vorstehenden Angaben vollständig und korrekt sind sowie, dass alle unter die GewAbfV fallenden Abfallfraktionen und Abfälle ordnungsgemäß entsorgt worden sind."}]
[]
["_________________________________________"]
[]
["Ort, Datum, AN-Unterschrift (Stempel)"]
[]
[]
[]
[]
{"$rows_left_out":8}
{"sheet":"Abfall","index":7,"n_rows":31,"n_cols":8,"rows_kept":31,"cut":false,"hidden":false,"merged":[[14,1,14,2],[16,0,25,0],[26,0,27,0]]}
[]
[]
[]
[]
[]
[]
[]
[]
[null,"Kumulative Erfassung des nicht gefährlichen Abfalls"]
[]
[null,"1. Angaben zur Baumaßnahme"]
[]
[null,{"$f":"\"Grundstück/Adresse: \"&'Blatt 1 Maßnahme und Erfassung'!B4","v":"Grundstück/Adresse: "}]
[]
[null,"Abfallschlüsselnummer nach AVV",null,"Vorbereitung \nzur Wiederverwendung","Recycling","sonstige Verwertung\n(energetisch/Verfüllung)","Beseitigung","Gesamt:"]
[null,null,null,"[t]","[t]","[t]","[t]","[t]"]
["Getrennt",170101,"Beton",{"$f":"IF(SUMIF(Scheine!$A$3:$A$800,Abfall!$B17,Scheine!L$3:L$800)>0,SUMIF(Scheine!$A$3:$A$800,Abfall!$B17,Scheine!L$3:L$800),\"\")","v":""},{"$f":"IF(SUMIF(Scheine!$A$3:$A$800,Abfall!$B17,Scheine!M$3:M$800)>0,SUMIF(Scheine!$A$3:$A$800,Abfall!$B17,Scheine!M$3:M$800),\"\")","v":""},{"$f":"IF(SUMIF(Scheine!$A$3:$A$800,Abfall!$B17,Scheine!N$3:N$800)>0,SUMIF(Scheine!$A$3:$A$800,Abfall!$B17,Scheine!N$3:N$800),\"\")","v":""},{"$f":"IF(SUMIF(Scheine!$A$3:$A$800,Abfall!$B17,Scheine!K$3:K$800)-SUM(D17:F17)>0,SUMIF(Scheine!$A$3:$A$800,Abfall!$B17,Scheine!K$3:K$800)-SUM(D17:F17),\"\")","v":""},{"$f":"IF(SUM(D17:G17)>0,SUM(D17:G17),\"\")","v":""}]
[null,170102,"Ziegel",{"$f":"IF(SUMIF(Scheine!$A$3:$A$800,Abfall!$B18,Scheine!L$3:L$800)>0,SUMIF(Scheine!$A$3:$A$800,Abfall!$B18,Scheine!L$3:L$800),\"\")","v":""},{"$f":"IF(SUMIF(Scheine!$A$3:$A$800,Abfall!$B18,Scheine!M$3:M$800)>0,SUMIF(Scheine!$A$3:$A$800,Abfall!$B18,Scheine!M$3:M$800),\"\")","v":""},{"$f":"IF(SUMIF(Scheine!$A$3:$A$800,Abfall!$B18,Scheine!N$3:N$800)>0,SUMIF(Scheine!$A$3:$A$800,Abfall!$B18,Scheine!N$3:N$800),\"\")","v":""},{"$f":"IF(SUMIF(Scheine!$A$3:$A$800,Abfall!$B18,Scheine!K$3:K$800)-SUM(D18:F18)>0,SUMIF(Scheine!$A$3:$A$800,Abfall!$B18,Scheine!K$3:K$800)-SUM(D18:F18),\"\")","v":""},{"$f":"IF(SUM(D18:G18)>0,SUM(D18:G18),\"\")","v":""}]
[null,170103,"Fliesen und Kreamik",{"$f":"IF(SUMIF(Scheine!$A$3:$A$800,Abfall!$B19,Scheine!L$3:L$800)>0,SUMIF(Scheine!$A$3:$A$800,Abfall!$B19,Scheine!L$3:L$800),\"\")","v":""},{"$f":"IF(SUMIF(Scheine!$A$3:$A$800,Abfall!$B19,Scheine!M$3:M$800)>0,SUMIF(Scheine!$A$3:$A$800,Abfall!$B19,Scheine!M$3:M$800),\"\")","v":""},{"$f":"IF(SUMIF(Scheine!$A$3:$A$800,Abfall!$B19,Scheine!N$3:N$800)>0,SUMIF(Scheine!$A$3:$A$800,Abfall!$B19,Scheine!N$3:N$800),\"\")","v":""},{"$f":"IF(SUMIF(Scheine!$A$3:$A$800,Abfall!$B19,Scheine!K$3:K$800)-SUM(D19:F19)>0,SUMIF(Scheine!$A$3:$A$800,Abfall!$B19,Scheine!K$3:K$800)-SUM(D19:F19),\"\")","v":""},""]
[null,170201,"Holz",{"$f":"IF(SUMIF(Scheine!$A$3:$A$800,Abfall!$B20,Scheine!L$3:L$800)>0,SUMIF(Scheine!$A$3:$A$800,Abfall!$B20,Scheine!L$3:L$800),\"\")","v":""},{"$f":"IF(SUMIF(Scheine!$A$3:$A$800,Abfall!$B20,Scheine!M$3:M$800)>0,SUMIF(Scheine!$A$3:$A$800,Abfall!$B20,Scheine!M$3:M$800),\"\")","v":""},{"$f":"IF(SUMIF(Scheine!$A$3:$A$800,Abfall!$B20,Scheine!N$3:N$800)>0,SUMIF(Scheine!$A$3:$A$800,Abfall!$B20,Scheine!N$3:N$800),\"\")","v":""},{"$f":"IF(SUMIF(Scheine!$A$3:$A$800,Abfall!$B20,Scheine!K$3:K$800)-SUM(D20:F20)>0,SUMIF(Scheine!$A$3:$A$800,Abfall!$B20,Scheine!K$3:K$800)-SUM(D20:F20),\"\")","v":""},""]
{"$rows_left_out":12}
{"sheet":"Table 0","index":8,"n_rows":843,"n_cols":5,"rows_kept":843,"cut":false,"hidden":true,"merged":[]}
["Column1","Column2","Column3","Column4","Column5"]
["Europäisches Abfallartenverzeichnis (AVV)","Europäisches Abfallartenverzeichnis (AVV)","Europäisches Abfallartenverzeichnis (AVV)","Europäisches Abfallartenverzeichnis (AVV)","Europäisches Abfallartenverzeichnis (AVV)"]
["2-Steller\r\n(AVV-Kapitel)","4-Steller\r\n(AVV-Gruppe)","6-Steller (Abfallart)","6-Steller (Abfallart)","6-Steller (Abfallart)"]
["2-Steller\r\n(AVV-Kapitel)","4-Steller\r\n(AVV-Gruppe)","Faktor","AVV-Schlüssel","AVV-Bezeichnung"]
["01","01 01","-","01 01 01","Abfälle aus dem Abbau von metallhaltigen Bodenschätzen"]
["01","01 01","1,3","01 01 02","Abfälle aus dem Abbau von nichtmetallhaltigen Bodenschätzen"]
["01","01 03","-","01 03 04*","Säure bildende Aufbereitungsrückstände aus der Verarbeitung von sulfidischem Erz"]
["01","01 03","-","01 03 05*","andere Aufbereitungsrückstände, die gefährliche Stoffe enthalten"]
["01","01 03","-","01 03 06","Aufbereitungsrückstände mit Ausnahme derjenigen, die unter 01 03 04 und 01 03 05 fallen"]
["01","01 03","-","01 03 07*","andere, gefährliche Stoffe enthaltende Abfälle aus der physikalischen und chemischen Verarbeitung von metallhaltigen Bodenschätzen"]
["01","01 03","-","01 03 08","staubende und pulvrige Abfälle mit Ausnahme derjenigen, die unter 01 03 07 fallen"]
["01","01 03","1,5","01 03 09","Rotschlamm aus der Aluminiumoxidherstellung mit Ausnahme von Rotschlamm, der unter 01 03 07 fällt"]
["01","01 03","-","01 03 99","Abfälle a.n.g."]
["01","01 04","1,40-1,80","01 04 07*","gefährliche Stoffe enthaltende Abfälle aus der physikalischen und chemischen Weiterverarbeitung von nichtmetallhaltigen Bodenschätzen"]
["01","01 04","1,4","01 04 08","Abfälle von Kies- und Gesteinsbruch mit Ausnahme derjenigen, die unter 01 04 07 fallen"]
["01","01 04","1,4","01 04 09","Abfälle von Sand und Ton"]
["01","01 04","1,8","01 04 10","staubende und pulvrige Abfälle mit Ausnahme derjenigen, die unter 01 04 07 fallen"]
["01","01 04","1,8","01 04 11","Abfälle aus der Verarbeitung von Kali- und Steinsalz mit Ausnahme derjenigen, die unter 01 04 07 fallen"]
["01","01 04","1,8","01 04 12","Aufbereitungsrückstände und andere Abfälle aus der Wäsche und Reinigung von Bodenschätzen mit Ausnahme derjenigen, die unter 01 04 07 und 01 04 11 fallen"]
["01","01 04","1,7","01 04 13","Abfälle aus Steinmetz- und -sägearbeiten mit Ausnahme derjenigen, die unter 01 04 07 fallen"]
{"$rows_left_out":823}